号角类
preferred label: Cors @fr
preferred label: 호른류 @ko
preferred label: Trompas @es
preferred label: Horn @dk
preferred label: Horns @en
preferred label: Rogi @pl
preferred label: Corni @it
preferred label: Tronpak @eu
preferred label: Trompes @ca
preferred label: Hörner @de
preferred label: Hoorns @nl
type: Concept
narrower: Ligawka

乐器
preferred label: Instrumentos musicales @es
preferred label: Instruments musicals @ca
preferred label: Musikinstrument @sv
preferred label: Strumenti musicali @it
preferred label: Musikinstrumenter @dk
preferred label: Musikinstrumente @de
preferred label: Muziekinstrumenten @nl
preferred label: Musical instruments @en
preferred label: 악기 @ko
preferred label: Instruments de musique @fr
preferred label: Soinu-tresnak @eu
preferred label: Instrumenty muzyczne @pl
type: ConceptScheme

Ligawka
alternative label: Legawka
alternative label: Legawa
alternative label: Ligawa
type: Concept
created: 2017-08-30
definition: A kind of horn (conical profile), made from a branch that is cut along in two halves, then each is hollowed, and finally both are put back together with the help of pitch and metal hoops; formerly used as a signal instrument (mainly in herding); since 19th c. used during Advent and watchnight service on Christmas Eve (mainly in north-east and east regions of Poland); nowadays as part of folk revival
in scheme: 乐器
editorial note: to be translated
broader: 号角类