乐器
preferred label: Instrumentos musicales @es
preferred label: Instruments musicals @ca
preferred label: Musikinstrument @sv
preferred label: Strumenti musicali @it
preferred label: Musikinstrumenter @dk
preferred label: Musikinstrumente @de
preferred label: Muziekinstrumenten @nl
preferred label: Musical instruments @en
preferred label: 악기 @ko
preferred label: Instruments de musique @fr
preferred label: Soinu-tresnak @eu
preferred label: Instrumenty muzyczne @pl
type: ConceptScheme

Tchikounda
alternative label: Kunda
alternative label: Tchikunda
preferred label: Flauta dulce baja @es
editorial note: to be translated
in scheme: 乐器
definition: Wooden double bell of the Kongo-Vili people in the Kouilou region near the Atlantic coast in the Republic of the Congo. Geometrical decoration engraved and burned. Used by the Nganga, healer and spiritualist, the hourglass shaped double bell is liked to Nkisi cult worship and is used during songs and dances to treat the ill. It is also played during twin birth ceremonies
broader: 铃类
type: Concept
created: 2017-08-30

铃类
preferred label: Dzwony @pl
preferred label: 종(鐘)류 @ko
preferred label: Campane @it
preferred label: Campanes @ca
preferred label: Kanpaiak @eu
preferred label: Glocken @de
preferred label: Bells @en
preferred label: Cloches @fr
preferred label: Klockor @sv
preferred label: Klokker @dk
preferred label: Campanas @es
preferred label: Bellen @nl
type: Concept
narrower: Tchikounda