Instrumentos musicales
preferred label: Instruments musicals @ca
preferred label: Musikinstrument @sv
preferred label: Strumenti musicali @it
preferred label: Musikinstrumenter @dk
preferred label: 乐器 @zh
preferred label: Musikinstrumente @de
preferred label: Muziekinstrumenten @nl
preferred label: Musical instruments @en
preferred label: 악기 @ko
preferred label: Instruments de musique @fr
preferred label: Soinu-tresnak @eu
preferred label: Instrumenty muzyczne @pl
type: ConceptScheme

Clarín bajo
editorial note: to be translated @fr
preferred label: Patenge @zh
in scheme: Instrumentos musicales
definition: Small single-headed square frame drum from the Teke people in the Republic of the Congo. The skin is nailed to a robust wooden frame. Held between the legs, the pitch can be changed by the pressure of the heel on the skin. Used to accompany the danse 'okilidzéké' of the young people. Also used in the 1920's in the maringa, an urban music style attributed amonst other to the Loango region on the French Congolese coast, and described as 'Europeanized' since it included also accordion and rhythms borrowed from polkas, marches, hymns, etc. The patenge is also played to accompany the rumba
created: 2017-08-30
broader: Tambores
alternative label: Patengue
type: Concept

Tambores
preferred label: 드럼 류 @ko
preferred label: Bębny @pl
preferred label: Trummor @sv
preferred label: Danborrak @eu
preferred label: 鼓类 @zh
preferred label: Tamburi @it
preferred label: Trommer @dk
preferred label: Tambours @fr
preferred label: Tambors @ca
preferred label: Trommeln @de
preferred label: Drums @nl
narrower: Clarín bajo
type: Concept