Ngoua ngomo
broader: 鼓类
editorial note: to be translated
preferred label: Fagotes @es
in scheme: 乐器
type: Concept
created: 2017-08-30
definition: Solid cylindrical (sometimes barrel or conical) drum (with or without feet carved out from the base) from the Teke-Ngangoulou people of the Plateau (Gamboma) region in the Republic of the Congo. Used to accompany songs in the ritual dances and popular festivities
alternative label: Ngou a ngomo

乐器
preferred label: Instrumentos musicales @es
preferred label: Instruments musicals @ca
preferred label: Musikinstrument @sv
preferred label: Strumenti musicali @it
preferred label: Musikinstrumenter @dk
preferred label: Musikinstrumente @de
preferred label: Muziekinstrumenten @nl
preferred label: Musical instruments @en
preferred label: 악기 @ko
preferred label: Instruments de musique @fr
preferred label: Soinu-tresnak @eu
preferred label: Instrumenty muzyczne @pl
type: ConceptScheme

鼓类
preferred label: 드럼 류 @ko
preferred label: Bębny @pl
preferred label: Trummor @sv
preferred label: Danborrak @eu
preferred label: Tambores @es
preferred label: Tamburi @it
preferred label: Trommer @dk
preferred label: Tambours @fr
preferred label: Tambors @ca
preferred label: Trommeln @de
preferred label: Drums @nl
narrower: Ngoua ngomo
type: Concept