Mukonzi
preferred label: Mandurria @es
in scheme: 乐器
created: 2017-08-30
definition: Slit drum from the Kongo and Bembe peoples of the Congo's. Used to accompany the Mufueti or Masoko dance. It is crescent shaped, played in pairs, and associated with religious and magical practices
type: Concept
editorial note: to be translated
broader: 鼓类
alternative label: Mukondzi

乐器
preferred label: Instrumentos musicales @es
preferred label: Instruments musicals @ca
preferred label: Musikinstrument @sv
preferred label: Strumenti musicali @it
preferred label: Musikinstrumenter @dk
preferred label: Musikinstrumente @de
preferred label: Muziekinstrumenten @nl
preferred label: Musical instruments @en
preferred label: 악기 @ko
preferred label: Instruments de musique @fr
preferred label: Soinu-tresnak @eu
preferred label: Instrumenty muzyczne @pl
type: ConceptScheme

鼓类
preferred label: 드럼 류 @ko
preferred label: Bębny @pl
preferred label: Trummor @sv
preferred label: Danborrak @eu
preferred label: Tambores @es
preferred label: Tamburi @it
preferred label: Trommer @dk
preferred label: Tambours @fr
preferred label: Tambors @ca
preferred label: Trommeln @de
preferred label: Drums @nl
type: Concept
narrower: Mukonzi