악기
preferred label: Instrumentos musicales @es
preferred label: Instruments musicals @ca
preferred label: Musikinstrument @sv
preferred label: Strumenti musicali @it
preferred label: Musikinstrumenter @dk
preferred label: 乐器 @zh
preferred label: Musikinstrumente @de
preferred label: Muziekinstrumenten @nl
preferred label: Musical instruments @en
preferred label: Instruments de musique @fr
preferred label: Soinu-tresnak @eu
preferred label: Instrumenty muzyczne @pl
type: ConceptScheme

공류
preferred label: Gong @it
preferred label: Gongak @eu
preferred label: Gongi @pl
preferred label: Gongar @sv
preferred label: Gonger @dk
preferred label: Gongs @nl
preferred label: 锣类 @zh
type: Concept
narrower: 징

징
alternative label: 대금(大金)
alternative label: Daegeum
alternative label: Ching
in scheme: 악기
definition: "The jing is brass gong and is played with a stick covered with soft cloth. According to the treatise of Akhakgwebeom (1493), it is described that the stick is covered with deer skin." (Gugak center, Korea)
preferred label: Jing @dk
created: 2010-09-07
type: Concept
broader: 공류