Ssangpiri
editorial note: to be translated @nl
broader: Oboes
created: 2019-05-24
in scheme: Instrumentos musicales
type: Concept
definition: The ssangpiri, a wind instrument with reed, uses two bamboo bodies. Two pipes made of sinudae bamboo are tied together with silk or thin copper wire. There are six holes and one in the back and the other in the front. It is transmitted in Ganghwa region in Gyeonggi-do Province

Oboes
preferred label: Oboje @pl
preferred label: 오보에류 @ko
preferred label: Oboès @ca
preferred label: Oboeak @eu
preferred label: Oboi @it
preferred label: Hobo's @nl
preferred label: 双簧管类 @zh
preferred label: Oboer @dk
preferred label: Oboen @de
preferred label: Hautbois @fr
type: Concept
narrower: Ssangpiri

Instrumentos musicales
preferred label: Instruments musicals @ca
preferred label: Musikinstrument @sv
preferred label: Strumenti musicali @it
preferred label: Musikinstrumenter @dk
preferred label: 乐器 @zh
preferred label: Musikinstrumente @de
preferred label: Muziekinstrumenten @nl
preferred label: Musical instruments @en
preferred label: 악기 @ko
preferred label: Instruments de musique @fr
preferred label: Soinu-tresnak @eu
preferred label: Instrumenty muzyczne @pl
type: ConceptScheme