플루트류
preferred label: Fløjter @dk
preferred label: Fluiten @nl
preferred label: Flöjter @sv
preferred label: Flûtes @fr
preferred label: 长笛类 @zh
preferred label: Flautak @eu
preferred label: Flety @pl
preferred label: Flautas @es
preferred label: Flauti @it
preferred label: Flautes @ca
preferred label: Flöten @de
preferred label: Flutes @en
narrower: Sogwanja
type: Concept

Sogwanja
editorial note: to be translated @zh
broader: 플루트류
created: 2019-05-24
in scheme: 악기
type: Concept
definition: The sogwanja is a vertical wind instrument used by shepard boy in the past. It was made of bone of large bird or old yellow bamboo. There are one mouth hole and three finger holes all in one side.

악기
preferred label: Instrumentos musicales @es
preferred label: Instruments musicals @ca
preferred label: Musikinstrument @sv
preferred label: Strumenti musicali @it
preferred label: Musikinstrumenter @dk
preferred label: 乐器 @zh
preferred label: Musikinstrumente @de
preferred label: Muziekinstrumenten @nl
preferred label: Musical instruments @en
preferred label: Instruments de musique @fr
preferred label: Soinu-tresnak @eu
preferred label: Instrumenty muzyczne @pl
type: ConceptScheme