Musikinstrument
preferred label: Instrumentos musicales @es
preferred label: Instruments musicals @ca
preferred label: Strumenti musicali @it
preferred label: Musikinstrumenter @dk
preferred label: 乐器 @zh
preferred label: Musikinstrumente @de
preferred label: Muziekinstrumenten @nl
preferred label: Musical instruments @en
preferred label: 악기 @ko
preferred label: Instruments de musique @fr
preferred label: Soinu-tresnak @eu
preferred label: Instrumenty muzyczne @pl
type: ConceptScheme

Noego
editorial note: to be translated @de
broader: Trummor
preferred label: 뇌고 @ko
created: 2019-03-06
in scheme: Musikinstrument
type: Concept
definition: The noego is a drum set with six small drums colored in black. Each drum has only one drum head. The cone shaped side of the drums are put together and hung horizontally in a wooden frame. It was used in sacrificial rites for heavenly gods

Trummor
preferred label: 드럼 류 @ko
preferred label: Bębny @pl
preferred label: Danborrak @eu
preferred label: 鼓类 @zh
preferred label: Tambores @es
preferred label: Tamburi @it
preferred label: Trommer @dk
preferred label: Tambours @fr
preferred label: Tambors @ca
preferred label: Trommeln @de
preferred label: Drums @nl
narrower: Noego
type: Concept