Musikinstrument
preferred label: Instrumentos musicales @es
preferred label: Instruments musicals @ca
preferred label: Strumenti musicali @it
preferred label: Musikinstrumenter @dk
preferred label: 乐器 @zh
preferred label: Musikinstrumente @de
preferred label: Muziekinstrumenten @nl
preferred label: Musical instruments @en
preferred label: 악기 @ko
preferred label: Instruments de musique @fr
preferred label: Soinu-tresnak @eu
preferred label: Instrumenty muzyczne @pl
type: ConceptScheme

Trummor
preferred label: 드럼 류 @ko
preferred label: Bębny @pl
preferred label: Danborrak @eu
preferred label: 鼓类 @zh
preferred label: Tambores @es
preferred label: Tamburi @it
preferred label: Trommer @dk
preferred label: Tambours @fr
preferred label: Tambors @ca
preferred label: Trommeln @de
preferred label: Drums @nl
narrower: Noedo
type: Concept

Noedo
editorial note: to be translated @zh
definition: The noedo, colored in black, is a set of three small drums pierced crosswise on a long pole arranged with noego. When twisted the pole with both hands to play, the fine leather straps hit the six drumheads and make sounds
broader: Trummor
created: 2019-03-06
preferred label: 노고 @ko
type: Concept
in scheme: Musikinstrument