乐器
preferred label: Instrumentos musicales @es
preferred label: Instruments musicals @ca
preferred label: Musikinstrument @sv
preferred label: Strumenti musicali @it
preferred label: Musikinstrumenter @dk
preferred label: Musikinstrumente @de
preferred label: Muziekinstrumenten @nl
preferred label: Musical instruments @en
preferred label: 악기 @ko
preferred label: Instruments de musique @fr
preferred label: Soinu-tresnak @eu
preferred label: Instrumenty muzyczne @pl
type: ConceptScheme

Mugo
alternative label: Dance drum
editorial note: to be translated
created: 2019-03-05
broader: 鼓类
preferred label: 무고 @ko
definition: The mugo is a drum which is used to perform court festive dance "mugo." The manufacturing is same as the daego, but the drum is put on the frame and one head faces upward and hit. During the early Joseon period about 1493, eight mugo were arranged to dance "mugo." Each drum siginifies four directions and differentiated with a circle colored in four different colors, that are blue, red, white, and black
in scheme: 乐器
type: Concept

鼓类
preferred label: 드럼 류 @ko
preferred label: Bębny @pl
preferred label: Trummor @sv
preferred label: Danborrak @eu
preferred label: Tambores @es
preferred label: Tamburi @it
preferred label: Trommer @dk
preferred label: Tambours @fr
preferred label: Tambors @ca
preferred label: Trommeln @de
preferred label: Drums @nl
type: Concept
narrower: Mugo