乐器
type: ConceptScheme
preferred label: Instrumentos musicales @es
preferred label: Instruments musicals @ca
preferred label: Musikinstrument @sv
preferred label: Strumenti musicali @it
preferred label: Musikinstrumenter @dk
preferred label: Musikinstrumente @de
preferred label: Muziekinstrumenten @nl
preferred label: Musical instruments @en
preferred label: 악기 @ko
preferred label: Instruments de musique @fr
preferred label: Soinu-tresnak @eu
preferred label: Instrumenty muzyczne @pl

Ankuoc
type: Concept
definition: Guimbarde originaire du Cambodge. Il en existe deux sortes : la première, en métal, possède une languette hétéroglotte alourdie à son extrémité par une boule de cire. La deuxième, fabriquée en bambou, a une languette idioglotte
alternative label: Angkuoc
alternative label: Angkuoch
in scheme: 乐器
broader: 口弦类
editorial note: to be translated
created: 2017-08-30

口弦类
type: Concept
preferred label: Musu-gitarrak @eu
preferred label: Mondharpen @nl
preferred label: Guimbardas @es
preferred label: Drumle @pl
preferred label: Mundgiger @dk
preferred label: Maultrommeln @de
preferred label: Scacciapensieri @it
preferred label: 구금류 @ko
preferred label: Guimbardes @fr
preferred label: Mungigor @sv
preferred label: Trumps @en
narrower: Ankuoc