Harmonia pedałowa
type: Concept
created: 2017-08-30
preferred label: Harmonia pedalowa @eu
definition: Pedal accordion, bellows connected to the instrument with a two-piece pipe. After World War I the accordion became a popular component of polish folk bands (together with the violin and the drum); the pedal type being especially popular in Mazovia on the right side of the Vistula river (the region of Kurpie and the area of Garwolin), to some degree also in Podlasie (Podlachia)
broader: 手风琴类
editorial note: to be translated
in scheme: 乐器

手风琴类
type: Concept
preferred label: Akkordeons @de
preferred label: Acordeones @es
preferred label: Akordeoiak @eu
preferred label: Dragspel @sv
preferred label: Accordions @en
preferred label: 아코디언류 @ko
preferred label: Accordéons @fr
preferred label: Fisarmoniche @it
preferred label: Harmonikaer @dk
preferred label: Accordeons @nl
preferred label: Akordeony @pl
preferred label: Acordions @ca
narrower: Harmonia pedałowa

乐器
type: ConceptScheme
preferred label: Instrumentos musicales @es
preferred label: Instruments musicals @ca
preferred label: Musikinstrument @sv
preferred label: Strumenti musicali @it
preferred label: Musikinstrumenter @dk
preferred label: Musikinstrumente @de
preferred label: Muziekinstrumenten @nl
preferred label: Musical instruments @en
preferred label: 악기 @ko
preferred label: Instruments de musique @fr
preferred label: Soinu-tresnak @eu
preferred label: Instrumenty muzyczne @pl