风笛类
type: Concept
preferred label: Säckpipor @sv
preferred label: Cornamusas @es
preferred label: Doedelzakken @nl
preferred label: Sækkepiber @dk
preferred label: Cornemuses @fr
preferred label: Sackpfeifen @de
preferred label: Cornamuses @ca
preferred label: Bagpipes @en
preferred label: Cornamuse @it
preferred label: 백파이프류 @ko
preferred label: Dudy @pl
preferred label: Xirolarruak @eu
narrower: Koza

Koza
type: Concept
editorial note: to be translated
broader: 风笛类
created: 2017-08-30
definition: A polish bagpipe from Podhale region. A mouth blown instrument; four voices; has a short triple chanter-drone pipe (5+1 fingerholes) and a long drone pipe ending in a hyperbolic bell (of a clarinet type); all pipes with cylindrical bores; bag made from a goat's whole skin; formerly played solo (by shepherds, wandering musicians), nowadays in folk revival, sometimes included in Podhale bands. The ability to build and play the Podhale bagpipe, or goat, were included on the National List of Intangible Cultural Heritage
in scheme: 乐器

乐器
type: ConceptScheme
preferred label: Instrumentos musicales @es
preferred label: Instruments musicals @ca
preferred label: Musikinstrument @sv
preferred label: Strumenti musicali @it
preferred label: Musikinstrumenter @dk
preferred label: Musikinstrumente @de
preferred label: Muziekinstrumenten @nl
preferred label: Musical instruments @en
preferred label: 악기 @ko
preferred label: Instruments de musique @fr
preferred label: Soinu-tresnak @eu
preferred label: Instrumenty muzyczne @pl