Angoho
type: Concept
created: 2017-08-30
editorial note: to be translated
definition: Compact large single-headed cylindrical drum with feet carved out of the base, and which is beated with a stick. Played by of the Mbosi-Koyo people in the Cuvette region of Republic of the Congo. Geometrical engravings decorate the body. Used in the Odaki (OdaKé) lovers dance, and in the Ekongo warriors dance
in scheme: 乐器
broader: 鼓类

乐器
type: ConceptScheme
preferred label: Instrumentos musicales @es
preferred label: Instruments musicals @ca
preferred label: Musikinstrument @sv
preferred label: Strumenti musicali @it
preferred label: Musikinstrumenter @dk
preferred label: Musikinstrumente @de
preferred label: Muziekinstrumenten @nl
preferred label: Musical instruments @en
preferred label: 악기 @ko
preferred label: Instruments de musique @fr
preferred label: Soinu-tresnak @eu
preferred label: Instrumenty muzyczne @pl

鼓类
type: Concept
preferred label: 드럼 류 @ko
preferred label: Bębny @pl
preferred label: Trummor @sv
preferred label: Danborrak @eu
preferred label: Tambores @es
preferred label: Tamburi @it
preferred label: Trommer @dk
preferred label: Tambours @fr
preferred label: Tambors @ca
preferred label: Trommeln @de
preferred label: Drums @nl
narrower: Angoho