Tsoumba
type: Concept
created: 2017-08-30
preferred label: Flauta dulce soprano @es
definition: Conical or cylindrical drum of the Teke people of the Plateaux region in Republic of the Congo, made from the holow trunk of a tree, on to one opening of which is nailed an antelope skin. The nails are covered by a strip made from caoutchouc
broader: 鼓类
editorial note: to be translated
in scheme: 乐器

鼓类
type: Concept
preferred label: 드럼 류 @ko
preferred label: Bębny @pl
preferred label: Trummor @sv
preferred label: Danborrak @eu
preferred label: Tambores @es
preferred label: Tamburi @it
preferred label: Trommer @dk
preferred label: Tambours @fr
preferred label: Tambors @ca
preferred label: Trommeln @de
preferred label: Drums @nl
narrower: Tsoumba

乐器
type: ConceptScheme
preferred label: Instrumentos musicales @es
preferred label: Instruments musicals @ca
preferred label: Musikinstrument @sv
preferred label: Strumenti musicali @it
preferred label: Musikinstrumenter @dk
preferred label: Musikinstrumente @de
preferred label: Muziekinstrumenten @nl
preferred label: Musical instruments @en
preferred label: 악기 @ko
preferred label: Instruments de musique @fr
preferred label: Soinu-tresnak @eu
preferred label: Instrumenty muzyczne @pl