乐器
type: ConceptScheme
preferred label: Instrumentos musicales @es
preferred label: Instruments musicals @ca
preferred label: Musikinstrument @sv
preferred label: Strumenti musicali @it
preferred label: Musikinstrumenter @dk
preferred label: Musikinstrumente @de
preferred label: Muziekinstrumenten @nl
preferred label: Musical instruments @en
preferred label: 악기 @ko
preferred label: Instruments de musique @fr
preferred label: Soinu-tresnak @eu
preferred label: Instrumenty muzyczne @pl

鼓类
type: Concept
preferred label: 드럼 류 @ko
preferred label: Bębny @pl
preferred label: Trummor @sv
preferred label: Danborrak @eu
preferred label: Tambores @es
preferred label: Tamburi @it
preferred label: Trommer @dk
preferred label: Tambours @fr
preferred label: Tambors @ca
preferred label: Trommeln @de
preferred label: Drums @nl
narrower: N'danda

N'danda
type: Concept
broader: 鼓类
definition: Longitudinal wooden drum from the Kongo and Vili people of the Kouilou region (Pointe-Noire) in the Republic of the Congo. Played horizontally, with a handle carved in the wooden sound box. Used for the healing ritual called ' n'assi ', for popular festivities and also used for communication
in scheme: 乐器
created: 2017-08-30
editorial note: to be translated
preferred label: Organillo @es