乐器
type: ConceptScheme
preferred label: Instrumentos musicales @es
preferred label: Instruments musicals @ca
preferred label: Musikinstrument @sv
preferred label: Strumenti musicali @it
preferred label: Musikinstrumenter @dk
preferred label: Musikinstrumente @de
preferred label: Muziekinstrumenten @nl
preferred label: Musical instruments @en
preferred label: 악기 @ko
preferred label: Instruments de musique @fr
preferred label: Soinu-tresnak @eu
preferred label: Instrumenty muzyczne @pl

Nodo (To be translated)
type: Concept
alternative label: Nogo
preferred label: Nodo @dk
preferred label: 노도 @ko
created: 2010-08-29
in scheme: 乐器
editorial note: to be translated
definition: The nodo, colored in red, is a set of two small drums pierced crosswise on a long pole. Each drum has two drum heads. When twisted with both hands to play, the fine leather straps hit the four drumheads and make sounds
broader: 鼓类

鼓类
type: Concept
preferred label: 드럼 류 @ko
preferred label: Bębny @pl
preferred label: Trummor @sv
preferred label: Danborrak @eu
preferred label: Tambores @es
preferred label: Tamburi @it
preferred label: Trommer @dk
preferred label: Tambours @fr
preferred label: Tambors @ca
preferred label: Trommeln @de
preferred label: Drums @nl
narrower: Nodo (To be translated)