케멘체
type: Concept
preferred label: Kemençe @nl
alternative label: Fasil kemençe
alternative label: 파실 케멘체
alternative label: Kamayacha @zh
broader: 피들류
in scheme: 악기
created: 2010-06-07
definition: (i) Short-necked fiddle from Turkey with a bottle-shaped soundboard and three strings; (ii) in Western Turkey the kemençe is similar to the Greek lyra with a pear shaped soundboard and three strings

피들류
type: Concept
narrower: 케멘체
preferred label: Fídulas @es
preferred label: 小提琴类 @zh
preferred label: Strumenti ad arco @it
preferred label: Fiddlor @sv
preferred label: Vedels @nl
preferred label: Fiddles @en
preferred label: Fidler @dk
preferred label: Chordofony szyjkowe, smyczkowe @pl
preferred label: Fideln @de
preferred label: Vièles @fr
preferred label: Fídules @ca
preferred label: Fidulak @eu

악기
type: ConceptScheme
preferred label: Instrumentos musicales @es
preferred label: Instruments musicals @ca
preferred label: Musikinstrument @sv
preferred label: Strumenti musicali @it
preferred label: Musikinstrumenter @dk
preferred label: 乐器 @zh
preferred label: Musikinstrumente @de
preferred label: Muziekinstrumenten @nl
preferred label: Musical instruments @en
preferred label: Instruments de musique @fr
preferred label: Soinu-tresnak @eu
preferred label: Instrumenty muzyczne @pl