长笛类
type: Concept
preferred label: Fløjter @dk
preferred label: Fluiten @nl
preferred label: 플루트류 @ko
preferred label: Flöjter @sv
preferred label: Flûtes @fr
preferred label: Flautak @eu
preferred label: Flety @pl
preferred label: Flautas @es
preferred label: Flauti @it
preferred label: Flautes @ca
preferred label: Flöten @de
preferred label: Flutes @en
narrower: Guridangdanso

Guridangdanso
type: Concept
editorial note: to be translated
in scheme: 乐器
broader: 长笛类
definition: The guridangdanso is a kind of danso. It is used to be played in Gangwon-do Province. It looks similar to the danso and there are five finger holes and one hole is at the back.
created: 2019-05-22

乐器
type: ConceptScheme
preferred label: Instrumentos musicales @es
preferred label: Instruments musicals @ca
preferred label: Musikinstrument @sv
preferred label: Strumenti musicali @it
preferred label: Musikinstrumenter @dk
preferred label: Musikinstrumente @de
preferred label: Muziekinstrumenten @nl
preferred label: Musical instruments @en
preferred label: 악기 @ko
preferred label: Instruments de musique @fr
preferred label: Soinu-tresnak @eu
preferred label: Instrumenty muzyczne @pl