乐器
type: ConceptScheme
preferred label: Instrumentos musicales @es
preferred label: Instruments musicals @ca
preferred label: Musikinstrument @sv
preferred label: Strumenti musicali @it
preferred label: Musikinstrumenter @dk
preferred label: Musikinstrumente @de
preferred label: Muziekinstrumenten @nl
preferred label: Musical instruments @en
preferred label: 악기 @ko
preferred label: Instruments de musique @fr
preferred label: Soinu-tresnak @eu
preferred label: Instrumenty muzyczne @pl

鼓类
type: Concept
preferred label: 드럼 류 @ko
preferred label: Bębny @pl
preferred label: Trummor @sv
preferred label: Danborrak @eu
preferred label: Tambores @es
preferred label: Tamburi @it
preferred label: Trommer @dk
preferred label: Tambours @fr
preferred label: Tambors @ca
preferred label: Trommeln @de
preferred label: Drums @nl
narrower: Galgo

Galgo
type: Concept
broader: 鼓类
editorial note: to be translated
alternative label: Yangjanggu
alternative label: 양장구 @ko
created: 2019-03-05
preferred label: 갈고 @ko
in scheme: 乐器
definition: The galgo is almost the same as the janggu in its size and shape, but the musician uses two sticks in both hands. The direction for tightening the drum heads are different that it can tighten both sides while the Janggu can only tighten toward the right side