Abak
type: Concept
broader: 拍板类
definition: The abak is dance prop which is made of six boards made of ivory or bone of whale, cow or deer. It is smaller than the bak. It makes sound when a musician unfolds the boards making fan shape, and closes them
preferred label: 아박 @ko
created: 2019-03-05
editorial note: to be translated
in scheme: 乐器

拍板类
type: Concept
preferred label: Klappere @dk
preferred label: 클래퍼류 @ko
preferred label: Claquettes @fr
preferred label: Kleppers @nl
preferred label: Claquetes @ca
preferred label: Klappern @de
preferred label: Klaskanki @pl
preferred label: Clappers @en
preferred label: Klapper @sv
preferred label: Txaramelak @eu
preferred label: Clappers / Idiofoni a concussione @it
preferred label: Claquetas @es
narrower: Abak

乐器
type: ConceptScheme
preferred label: Instrumentos musicales @es
preferred label: Instruments musicals @ca
preferred label: Musikinstrument @sv
preferred label: Strumenti musicali @it
preferred label: Musikinstrumenter @dk
preferred label: Musikinstrumente @de
preferred label: Muziekinstrumenten @nl
preferred label: Musical instruments @en
preferred label: 악기 @ko
preferred label: Instruments de musique @fr
preferred label: Soinu-tresnak @eu
preferred label: Instrumenty muzyczne @pl