마우스피스
type: Concept
preferred label: Ustniki @pl
preferred label: Embocadures @ca
preferred label: 吹嘴类 @zh
preferred label: Boquillas @es
preferred label: Ahoko piezak @eu
preferred label: Munstycken @sv
preferred label: Bocchini @it
preferred label: Mouthpieces @en
preferred label: Mundstücke @de
preferred label: Mondstukken @nl
preferred label: Mundstykker @dk
preferred label: Embouchures @fr
narrower: 혀(舌)

혀(舌)
type: Concept
definition: Hyeo is the double-reed inserted into the bamboo pipe of the Piri or Taepyeongso. The musicians hold and blow the air into the seo to shake and resonate the pipe. Piri Hyeo is made by planing the bamboo bark and Taepyeongso Hyeo is made of reed
preferred label: Hyeo @zh
alternative label: 서
alternative label: Seo
created: 2019-03-05
broader: 마우스피스
editorial note: to be translated @zh
in scheme: 악기

악기
type: ConceptScheme
preferred label: Instrumentos musicales @es
preferred label: Instruments musicals @ca
preferred label: Musikinstrument @sv
preferred label: Strumenti musicali @it
preferred label: Musikinstrumenter @dk
preferred label: 乐器 @zh
preferred label: Musikinstrumente @de
preferred label: Muziekinstrumenten @nl
preferred label: Musical instruments @en
preferred label: Instruments de musique @fr
preferred label: Soinu-tresnak @eu
preferred label: Instrumenty muzyczne @pl