金属板琴
type: Concept
preferred label: Metalofony @pl
preferred label: Metalofonoak @eu
preferred label: Metallofoner @dk
preferred label: Metallophone @de
preferred label: Metalófonos @es
preferred label: 메탈로폰류 @ko
preferred label: Metallofoni @it
preferred label: Metallofonen @nl
preferred label: Metallophones @en
preferred label: Métallophones @fr
preferred label: Metal·lòfons @ca
narrower: Ulla

Ulla
type: Concept
preferred label: 운라 @ko
broader: 金属板琴
alternative label: Yunluo
created: 2019-03-04
definition: "The ulla is a percussion instrument comprising a set of ten small copper gongs in plate shape. There are two kinds of ulla with a wooden frame or a hand grip. When playing it walking and moving, musician holds the ulla with the grip in his left hand. When playing it in a appointed position, the musician uses the one on a frame." (Gugak Center, Korea) Obsolete tuned metal gongs of Korea, the Korean name for Chinese Yunluo. The set of ten thin disc-shaped gongs were mounted in a portable wooden frame in three rows of three with a single gong on top ... The instrument is considered Chinese ... The only extant examples now in Korea, were brought from Beijing in 1937" (Grove Dictionary of Musical Instruments, 1984)
in scheme: 乐器
editorial note: to be translated

乐器
type: ConceptScheme
preferred label: Instrumentos musicales @es
preferred label: Instruments musicals @ca
preferred label: Musikinstrument @sv
preferred label: Strumenti musicali @it
preferred label: Musikinstrumenter @dk
preferred label: Musikinstrumente @de
preferred label: Muziekinstrumenten @nl
preferred label: Musical instruments @en
preferred label: 악기 @ko
preferred label: Instruments de musique @fr
preferred label: Soinu-tresnak @eu
preferred label: Instrumenty muzyczne @pl