Rasseln
type: Concept
preferred label: Sonalls @ca
preferred label: Sonagli / Idiofoni a scuotimento @it
preferred label: Raslere @dk
preferred label: Hochets @fr
preferred label: 래틀류 @ko
preferred label: Skallror @sv
preferred label: Idiofony potrząsane @pl
preferred label: Sonailuak @eu
preferred label: Rattles @en
preferred label: Rammelaars @nl
preferred label: 拨浪鼓 @zh
preferred label: Sonajas @es
narrower: Manyanga

Manyanga
type: Concept
editorial note: to be translated
created: 2019-02-21
broader: Rasseln
definition: Shaker of the Mijikenda people of Kenya, made of a dried calebash. a wooden handle is put in the open neck of the calebash. Used in pairs to provide percussive sounds to the Chechemeko dance
in scheme: Musikinstrumente

Musikinstrumente
type: ConceptScheme
preferred label: Instrumentos musicales @es
preferred label: Instruments musicals @ca
preferred label: Musikinstrument @sv
preferred label: Strumenti musicali @it
preferred label: Musikinstrumenter @dk
preferred label: 乐器 @zh
preferred label: Muziekinstrumenten @nl
preferred label: Musical instruments @en
preferred label: 악기 @ko
preferred label: Instruments de musique @fr
preferred label: Soinu-tresnak @eu
preferred label: Instrumenty muzyczne @pl