乐器
type: ConceptScheme
preferred label: Instrumentos musicales @es
preferred label: Instruments musicals @ca
preferred label: Musikinstrument @sv
preferred label: Strumenti musicali @it
preferred label: Musikinstrumenter @dk
preferred label: Musikinstrumente @de
preferred label: Muziekinstrumenten @nl
preferred label: Musical instruments @en
preferred label: 악기 @ko
preferred label: Instruments de musique @fr
preferred label: Soinu-tresnak @eu
preferred label: Instrumenty muzyczne @pl

Ching'oma
type: Concept
editorial note: to be translated
in scheme: 乐器
definition: Set of three drums (sing. = Engoma) of the Luhya-Bukusu people of West Kenya: usually one big drum and two smaller ones. They are held around the waist, with a belt. Played with two sticks, or with one stick and one hand. They are made of metal tanks, covered with cow hide on both sides, laced together with cow hide laces. They are smaller than the endumba drum, which fills in the base beats. The cing'oma accompany the litungu and the ishiriri. Played in a set of three, but can also be played solo, in pair or in a set of more than three, according to the skills of the player. Played in the Kamobeka dance, completed with the Endumba / Indumba drum.
broader: 鼓类
created: 2019-02-14

鼓类
type: Concept
preferred label: 드럼 류 @ko
preferred label: Bębny @pl
preferred label: Trummor @sv
preferred label: Danborrak @eu
preferred label: Tambores @es
preferred label: Tamburi @it
preferred label: Trommer @dk
preferred label: Tambours @fr
preferred label: Tambors @ca
preferred label: Trommeln @de
preferred label: Drums @nl
narrower: Ching'oma