其他类
type: Concept
preferred label: Sonstige @de
preferred label: Andere @nl
preferred label: Beste batzuk @eu
preferred label: Otros @es
preferred label: Others @en
preferred label: Altri @it
preferred label: 기타류 @ko
preferred label: Inne @pl
preferred label: Övriga @sv
preferred label: Altres @ca
preferred label: Andre @dk
preferred label: Autres @fr
narrower: Buzzer

Buzzer
type: Concept
in scheme: 乐器
alternative label: Whirring disc
editorial note: to be translated
created: 2019-01-29
definition: New Grove dictionary, 1984: "Buzzer [spinning disc]. A free aerophone, akin to the bullroarer but distinguished from it in that a buzzer (usually shpaed like a disc, less often a blade) has two holes through which a cord is threaded and the ends tied together. The player holds the cord and swings it rapidly to twist it; an outward pull on the cord causes it to unwind rapidly and then wind up again in the opposite direction, the disc meanwhile making a humming sound. Buzzers are known as toys but are also often associated with ritual or magic. Examples include 'fir-fur', 'koororohuu', 'ukas', 'umampembe' and 'uvuru'. New Grove dictionary, 1984: "Whirling aerophone. Term used in the Hornbostel-Sachs classification (412.22), exemplified by the 'bullroarer' and the 'whirring disc' (see 'buzzer')"
broader: 其他类

乐器
type: ConceptScheme
preferred label: Instrumentos musicales @es
preferred label: Instruments musicals @ca
preferred label: Musikinstrument @sv
preferred label: Strumenti musicali @it
preferred label: Musikinstrumenter @dk
preferred label: Musikinstrumente @de
preferred label: Muziekinstrumenten @nl
preferred label: Musical instruments @en
preferred label: 악기 @ko
preferred label: Instruments de musique @fr
preferred label: Soinu-tresnak @eu
preferred label: Instrumenty muzyczne @pl