乐器
type: ConceptScheme
preferred label: Instrumentos musicales @es
preferred label: Instruments musicals @ca
preferred label: Musikinstrument @sv
preferred label: Strumenti musicali @it
preferred label: Musikinstrumenter @dk
preferred label: Musikinstrumente @de
preferred label: Muziekinstrumenten @nl
preferred label: Musical instruments @en
preferred label: 악기 @ko
preferred label: Instruments de musique @fr
preferred label: Soinu-tresnak @eu
preferred label: Instrumenty muzyczne @pl

鼓类
type: Concept
narrower: Ndungu
preferred label: 드럼 류 @ko
preferred label: Bębny @pl
preferred label: Trummor @sv
preferred label: Danborrak @eu
preferred label: Tambores @es
preferred label: Tamburi @it
preferred label: Trommer @dk
preferred label: Tambours @fr
preferred label: Tambors @ca
preferred label: Trommeln @de
preferred label: Drums @nl

Ndungu
type: Concept
created: 2017-08-30
broader: 鼓类
definition: Cylindro-concial drum of the Konda and Yembe peoples of the DRC. The name is also used for the footed conical drum of the Kongo and Bembe peoples of the Republic of Congo
editorial note: to be translated
in scheme: 乐器