Musikinstrumenter
type: ConceptScheme
preferred label: Instrumentos musicales @es
preferred label: Instruments musicals @ca
preferred label: Musikinstrument @sv
preferred label: Strumenti musicali @it
preferred label: 乐器 @zh
preferred label: Musikinstrumente @de
preferred label: Muziekinstrumenten @nl
preferred label: Musical instruments @en
preferred label: 악기 @ko
preferred label: Instruments de musique @fr
preferred label: Soinu-tresnak @eu
preferred label: Instrumenty muzyczne @pl

Trommer
type: Concept
narrower: Tourou
preferred label: 드럼 류 @ko
preferred label: Bębny @pl
preferred label: Trummor @sv
preferred label: Danborrak @eu
preferred label: 鼓类 @zh
preferred label: Tambores @es
preferred label: Tamburi @it
preferred label: Tambours @fr
preferred label: Tambors @ca
preferred label: Trommeln @de
preferred label: Drums @nl

Tourou
type: Concept
created: 2015-08-02
broader: Trommer
definition: Double-headed hourglass pression drum (also known as the variable tension drum or the talking drum), from the Siamou people in Burkina Faso (compared to the other Burkina talking drums there are considerably fewer strings attached to change the tensions of the membranes)
editorial note: to be translated @zh
in scheme: Musikinstrumenter