Musikinstrumente
type: ConceptScheme
preferred label: Instrumentos musicales @es
preferred label: Instruments musicals @ca
preferred label: Musikinstrument @sv
preferred label: Strumenti musicali @it
preferred label: Musikinstrumenter @dk
preferred label: 乐器 @zh
preferred label: Muziekinstrumenten @nl
preferred label: Musical instruments @en
preferred label: 악기 @ko
preferred label: Instruments de musique @fr
preferred label: Soinu-tresnak @eu
preferred label: Instrumenty muzyczne @pl

Oboen
type: Concept
narrower: Whit horn
preferred label: Oboje @pl
preferred label: 오보에류 @ko
preferred label: Oboès @ca
preferred label: Oboeak @eu
preferred label: Oboi @it
preferred label: Hobo's @nl
preferred label: 双簧管类 @zh
preferred label: Oboer @dk
preferred label: Oboes @es
preferred label: Hautbois @fr

Whit horn
type: Concept
created: 2010-06-07
alternative label: Bark oboe
alternative label: May horn
broader: Oboen
definition: New Grove Dictionary, 1984: "Whithorn [May-horn]. An oboe made of gtreen willow bark twisted into a conical shape and fastened with hawthorn spines. It has a double reed made of soft willow bar pressed together. It is widely used in Europe, mainly by herdsmen for signalling; in England it was used in the Oxfordshire forests in connection with a local Whit Monday hunt. It is also sometimes played by children, itinerant vendors and tradesmen. It produces one loud sound which may be caused to fluctuate in pitch by a variation of breath pressure.
in scheme: Musikinstrumente
preferred label: Whithorn @dk
preferred label: 휘트호른 @ko