Musikinstrumenter
type: ConceptScheme
preferred label: Instrumentos musicales @es
preferred label: Instruments musicals @ca
preferred label: Musikinstrument @sv
preferred label: Strumenti musicali @it
preferred label: 乐器 @zh
preferred label: Musikinstrumente @de
preferred label: Muziekinstrumenten @nl
preferred label: Musical instruments @en
preferred label: 악기 @ko
preferred label: Instruments de musique @fr
preferred label: Soinu-tresnak @eu
preferred label: Instrumenty muzyczne @pl

Trommer
type: Concept
narrower: Djembe
preferred label: 드럼 류 @ko
preferred label: Bębny @pl
preferred label: Trummor @sv
preferred label: Danborrak @eu
preferred label: 鼓类 @zh
preferred label: Tambores @es
preferred label: Tamburi @it
preferred label: Tambours @fr
preferred label: Tambors @ca
preferred label: Trommeln @de
preferred label: Drums @nl

Djembe
type: Concept
created: 2010-04-20
alternative label: Jembe
alternative label: Dhime @zh
broader: Trommer
definition: A type of drum played with both bare hands. It is in widespread use primarily in Mali and Guinea among the Maninka and Susu peoples, and also in neighbouring Senegal, Côte d'Ivoire and Burkina Faso; it is also perhaps the most popular African drum outside the African continent
in scheme: Musikinstrumenter
preferred label: Djembé @es
preferred label: 非洲鼓 @zh
preferred label: 젬베 @ko