乐器
type: ConceptScheme
preferred label: Instrumentos musicales @es
preferred label: Instruments musicals @ca
preferred label: Musikinstrument @sv
preferred label: Strumenti musicali @it
preferred label: Musikinstrumenter @dk
preferred label: Musikinstrumente @de
preferred label: Muziekinstrumenten @nl
preferred label: Musical instruments @en
preferred label: 악기 @ko
preferred label: Instruments de musique @fr
preferred label: Soinu-tresnak @eu
preferred label: Instrumenty muzyczne @pl

Sogwanja
type: Concept
created: 2019-05-24
broader: 长笛类
definition: The sogwanja is a vertical wind instrument used by shepard boy in the past. It was made of bone of large bird or old yellow bamboo. There are one mouth hole and three finger holes all in one side.
editorial note: to be translated
in scheme: 乐器

长笛类
type: Concept
narrower: Sogwanja
preferred label: Fløjter @dk
preferred label: Fluiten @nl
preferred label: 플루트류 @ko
preferred label: Flöjter @sv
preferred label: Flûtes @fr
preferred label: Flautak @eu
preferred label: Flety @pl
preferred label: Flautas @es
preferred label: Flauti @it
preferred label: Flautes @ca
preferred label: Flöten @de
preferred label: Flutes @en