乐器
type: ConceptScheme
preferred label: Instrumentos musicales @es
preferred label: Instruments musicals @ca
preferred label: Musikinstrument @sv
preferred label: Strumenti musicali @it
preferred label: Musikinstrumenter @dk
preferred label: Musikinstrumente @de
preferred label: Muziekinstrumenten @nl
preferred label: Musical instruments @en
preferred label: 악기 @ko
preferred label: Instruments de musique @fr
preferred label: Soinu-tresnak @eu
preferred label: Instrumenty muzyczne @pl

Sugonghu
type: Concept
created: 2019-05-22
broader: 竖琴类
definition: The sugonghu is a vertical harp with twenty one strings. The soundbox is in the bottom, and the frame holding the strings is trapezium. The sugonghu possessed in the National Gugak Center is the one master Ham Hwa-jin brought from Beijing in 1937. Ham as the director went to China to see and inspect the Chinese music, and bought the instrument.
editorial note: to be translated @de
in scheme: 乐器

竖琴类
type: Concept
narrower: Sugonghu
preferred label: Harfen @de
preferred label: Arpe @it
preferred label: Harpor @sv
preferred label: Arpes @ca
preferred label: Harps @en
preferred label: Harfy @pl
preferred label: 하프류 @ko
preferred label: Harpak @eu
preferred label: Harpen @nl
preferred label: Arpas @es
preferred label: Harpes @fr
preferred label: Harper @dk