乐器
type: ConceptScheme
preferred label: Instrumentos musicales @es
preferred label: Instruments musicals @ca
preferred label: Musikinstrument @sv
preferred label: Strumenti musicali @it
preferred label: Musikinstrumenter @dk
preferred label: Musikinstrumente @de
preferred label: Muziekinstrumenten @nl
preferred label: Musical instruments @en
preferred label: 악기 @ko
preferred label: Instruments de musique @fr
preferred label: Soinu-tresnak @eu
preferred label: Instrumenty muzyczne @pl

Bridges
type: Concept
narrower: Wonsan
preferred label: Chevalets @fr

Wonsan
type: Concept
created: 2019-05-10
broader: Bridges
definition: The wonsan, made of a piece of gourd, is a bridge which support the two strings. It is put on the center of one side of the soundbox, but it is moveable to control the volume. Wonsan is put in the center to make louder volume, but the volume becomes weaker when it is moved upside.
editorial note: to be translated
in scheme: 乐器