乐器
type: ConceptScheme
preferred label: Instrumentos musicales @es
preferred label: Instruments musicals @ca
preferred label: Musikinstrument @sv
preferred label: Strumenti musicali @it
preferred label: Musikinstrumenter @dk
preferred label: Musikinstrumente @de
preferred label: Muziekinstrumenten @nl
preferred label: Musical instruments @en
preferred label: 악기 @ko
preferred label: Instruments de musique @fr
preferred label: Soinu-tresnak @eu
preferred label: Instrumenty muzyczne @pl

Soribuk
type: Concept
created: 2019-03-06
broader: 鼓类
definition: The soribuk looks same as the yonggo in its shape and size except for the dragon painting. Instead of using ropes to pull and to strech skin of the both drum heads, metal tacks fix the skin on the body. Different from the yonggo, the drum is put on the floor and the heads face left and right. The drummer most of the time uses it to accompany pansori and always plays it sitting on the floor.
editorial note: to be translated
in scheme: 乐器
preferred label: 소리북 @ko

鼓类
type: Concept
narrower: Soribuk
preferred label: 드럼 류 @ko
preferred label: Bębny @pl
preferred label: Trummor @sv
preferred label: Danborrak @eu
preferred label: Tambores @es
preferred label: Tamburi @it
preferred label: Trommer @dk
preferred label: Tambours @fr
preferred label: Tambors @ca
preferred label: Trommeln @de
preferred label: Drums @nl