乐器
type: ConceptScheme
preferred label: Instrumentos musicales @es
preferred label: Instruments musicals @ca
preferred label: Musikinstrument @sv
preferred label: Strumenti musicali @it
preferred label: Musikinstrumenter @dk
preferred label: Musikinstrumente @de
preferred label: Muziekinstrumenten @nl
preferred label: Musical instruments @en
preferred label: 악기 @ko
preferred label: Instruments de musique @fr
preferred label: Soinu-tresnak @eu
preferred label: Instrumenty muzyczne @pl

Eunggo
type: Concept
created: 2019-03-05
broader: 鼓类
definition: The eunggo is a drum hung on a wood frame decorated with phoenix and the moon on top. It was used for music of royal event and court banquet, put in the east side of the orchestra. When starting the music, sakgo, eunggo, and the geongo are hit in order as a set
editorial note: to be translated
in scheme: 乐器
preferred label: 응고 @ko

鼓类
type: Concept
narrower: Eunggo
preferred label: 드럼 류 @ko
preferred label: Bębny @pl
preferred label: Trummor @sv
preferred label: Danborrak @eu
preferred label: Tambores @es
preferred label: Tamburi @it
preferred label: Trommer @dk
preferred label: Tambours @fr
preferred label: Tambors @ca
preferred label: Trommeln @de
preferred label: Drums @nl