乐器
type: ConceptScheme
preferred label: Instrumentos musicales @es
preferred label: Instruments musicals @ca
preferred label: Musikinstrument @sv
preferred label: Strumenti musicali @it
preferred label: Musikinstrumenter @dk
preferred label: Musikinstrumente @de
preferred label: Muziekinstrumenten @nl
preferred label: Musical instruments @en
preferred label: 악기 @ko
preferred label: Instruments de musique @fr
preferred label: Soinu-tresnak @eu
preferred label: Instrumenty muzyczne @pl

Dojagi janggu
type: Concept
created: 2019-03-05
alternative label: 청자 장구 @ko
alternative label: Celadon janggu
broader: 鼓类
definition: The Dojagi janggu (celadon hourglass drum) was discovered in the historical site of the Goryeo Dynasty. It has thinner round tube, so the waist is slimmer and longer compared to the janggu used in the present, and the shape and size of the body are different
editorial note: to be translated
in scheme: 乐器
preferred label: 도자기 장구 @ko

鼓类
type: Concept
narrower: Dojagi janggu
preferred label: 드럼 류 @ko
preferred label: Bębny @pl
preferred label: Trummor @sv
preferred label: Danborrak @eu
preferred label: Tambores @es
preferred label: Tamburi @it
preferred label: Trommer @dk
preferred label: Tambours @fr
preferred label: Tambors @ca
preferred label: Trommeln @de
preferred label: Drums @nl