乐器
type: ConceptScheme
preferred label: Instrumentos musicales @es
preferred label: Instruments musicals @ca
preferred label: Musikinstrument @sv
preferred label: Strumenti musicali @it
preferred label: Musikinstrumenter @dk
preferred label: Musikinstrumente @de
preferred label: Muziekinstrumenten @nl
preferred label: Musical instruments @en
preferred label: 악기 @ko
preferred label: Instruments de musique @fr
preferred label: Soinu-tresnak @eu
preferred label: Instrumenty muzyczne @pl

Isikuti
type: Concept
created: 2019-02-21
alternative label: Isukuti
broader: 鼓类
definition: Goblet-shaped drum of the Luhya-Isukha people of West Kenya. The sound box is a log carved out, leaving out two protuberances to put the strap through. A lizzard skin is attached to the log with pins going through a rubber strap to hold the skin. Isikuti are played in sets of three; this is the smallest one, representing the child of the family. The drum is tuned by placing it next to the fire. The isikuti omwana keeps the constant rhythm; plays the highest tone; is played with the palms of the hands, while hung around the shoulder. It accompanies the isikuti dances and is used for communcaiton, as a signal instrument; the people know what the rhythm means: 'something is happening, let's go and see
editorial note: to be translated
in scheme: 乐器

鼓类
type: Concept
narrower: Isikuti
preferred label: 드럼 류 @ko
preferred label: Bębny @pl
preferred label: Trummor @sv
preferred label: Danborrak @eu
preferred label: Tambores @es
preferred label: Tamburi @it
preferred label: Trommer @dk
preferred label: Tambours @fr
preferred label: Tambors @ca
preferred label: Trommeln @de
preferred label: Drums @nl