Sets of blown plaques
notation: 142.2
definition: The substance of the instrument itself, owing to its solidity and elasticity, vibrates and radiates sound. The instrument is made to vibrate by being blown upon. The vibrating material consists of a set of blown plaques. Piano chanteur.
in scheme: Hornbostel - Sachs
broader: Blown plaques
type: Concept

Blown plaques
notation: 142
type: Concept
narrower: Sets of blown plaques

Hornbostel - Sachs
type: ConceptScheme