(Individual) blown sticks
notation: 141.1
definition: The substance of the instrument itself, owing to its solidity and elasticity, vibrates and radiates sound. The instrument is made to vibrate by being blown upon. The vibrating material consists of an individual stick. Unknown.
in scheme: Hornbostel - Sachs
broader: Blown sticks
type: Concept

Blown sticks
notation: 141
type: Concept
narrower: (Individual) blown sticks

Hornbostel - Sachs
type: ConceptScheme