Sets of friction sticks
notation: 131.2
type: Concept
narrower: Sets of friction sticks with indirect friction

Sets of friction sticks with indirect friction
notation: 131.22
definition: The substance of the instrument itself, owing to its solidity and elasticity, is made to vibrate and radiate sound by indirect friction. A set of sticks is connected with others that are rubbed and, by transmitting their longitudinal vibration, stimulate transverse vibration in the former. Chladni's euphon.
in scheme: Hornbostel - Sachs
broader: Sets of friction sticks
type: Concept

Hornbostel - Sachs
type: ConceptScheme