Single-skin goblet-shaped drums with membrane glued to drum
notation: 211.26-6
definition: Drums with tubular bodies consisting of a main section which is either cup-shaped or cylindrical, and a slender stem. A tightly stretched membrane encloses the upper end, and is directly struck by the player using the hands or intermediate devices such as sticks. With membrane glued to drum.
in scheme: Hornbostel - Sachs
broader: Goblet-shaped drums
type: Concept

Goblet-shaped drums
notation: 211.26
type: Concept
narrower: Single-skin goblet-shaped drums with membrane glued to drum

Hornbostel - Sachs
type: ConceptScheme