Individual double-skin hourglass-shaped drums, one skin used for playing
notation: 211.242.11
type: Concept
narrower: Individual double-skin hourglass-shaped drums, one skin used for playing with cord- (ribbon-) bracing

Individual double-skin hourglass-shaped drums, one skin used for playing with cord- (ribbon-) bracing
notation: 211.242.11-81
definition: An individual drum with a tubular body that has a smaller diameter at the middle than at the ends. Tightly stretched membranes enclose the body at either end. One membrane is directly struck by the player using the hands or intermediate devices such as sticks. With membrane laced to drum. Cord-(ribbon-) bracing. The cords are stretched from membrane to membrane or arranged in the form of a net.
in scheme: Hornbostel - Sachs
broader: Individual double-skin hourglass-shaped drums, one skin used for playing
type: Concept

Hornbostel - Sachs
type: ConceptScheme