Frame zithers without resonator
notation: 316.1
definition: Strings are stretched between fixed points across a rigid open frame. The instrument has no resonator. Perhaps amongst medieval psalteries.
in scheme: Hornbostel - Sachs
broader: Frame zithers
type: Concept

Frame zithers
notation: 316
type: Concept
narrower: Frame zithers without resonator

Hornbostel - Sachs
type: ConceptScheme