Individual double-skin hourglass-shaped drums, both heads played
definition: An individual drum with a tubular body that has a smaller diameter at the middle than at the ends. Tightly stretched membranes enclose the body at either end. Both membranes are directly struck by the player using the hands or intermediate devices such as sticks.
in scheme: Hornbostel - Sachs
broader: Individual double-skin hourglass-shaped drums
notation: 211.242.12
type: Concept

Individual double-skin hourglass-shaped drums
notation: 211.242.1
type: Concept
narrower: Individual double-skin hourglass-shaped drums, both heads played

Hornbostel - Sachs
type: ConceptScheme