Single-skin double-conical drums
notation: 211.231
type: Concept
narrower: Sets of single-skin double-conical drums

Sets of single-skin double-conical drums
notation: 211.231.2
definition: Sets of drums with tubular bodies that have a larger diameter at the middle than at the ends. The drum bodies are rectilinear, with an angular profile. Each drum body is enclosed at one end by a single tightly stretched membrane, and the opposite end is open. The membranes are directly struck by the player using the hands or intermediate devices such as sticks.
in scheme: Hornbostel - Sachs
broader: Single-skin double-conical drums
type: Concept

Hornbostel - Sachs
type: ConceptScheme