Scraped idiophones
notation: 112.2
type: Concept
narrower: Scraped vessels

Scraped vessels
definition: The substance of the instrument itself, owing to its solidity and elasticity, vibrates and radiates sound when scraped. The corrugated surface of a vessel is scraped. S. America, Congo region.
notation: 112.23
type: Concept
in scheme: Hornbostel - Sachs
broader: Scraped idiophones

Hornbostel - Sachs
type: ConceptScheme