Individual single-skin conical drums
definition: An individual drum with a tubular body in which the diameter at the ends differs considerably. It is enclosed at one end by a single tightly stretched membrane and the opposite end is open. The membrane is directly struck by the player using the hands or intermediate devices such as sticks.
notation: 211.251.1
broader: Single-skin conical drums
type: Concept
in scheme: Hornbostel - Sachs

Hornbostel - Sachs
type: ConceptScheme

Single-skin conical drums
notation: 211.251
type: Concept
narrower: Individual single-skin conical drums