Sets of double-skin cylindrical drums, both heads played
notation: 211.212.22
definition: Sets of drums with tubular bodies that have the same diameter at the middle and the ends. Each drum body is enclosed at either end by a tightly stretched membrane. Both membranes are directly struck by the player, using the hands or intermediate devices such as sticks.
in scheme: Hornbostel - Sachs
broader: Sets of double-skin cylindrical drums
type: Concept

Sets of double-skin cylindrical drums
notation: 211.212.2
type: Concept
narrower: Sets of double-skin cylindrical drums, both heads played

Hornbostel - Sachs
type: ConceptScheme