Single-skin frame drums with handle with membrane lapped onto a hoop
type: Concept
notation: 211.321-92
definition: Drums in which the depth of the body does not exceed the radius of the membrane. A stick forming a handle is attached to the frame in line with its diameter. The single tightly stretched membrane is directly struck by the player, using the hands or intermediate devices such as sticks. With membrane lapped onto a hoop.
in scheme: Hornbostel - Sachs
broader: Single-skin frame drums with handle

Hornbostel - Sachs
type: ConceptScheme

Single-skin frame drums with handle
type: Concept
notation: 211.321
narrower: Single-skin frame drums with handle with membrane lapped onto a hoop